{"text_format":"1","workbook":"xlsx","n_sheets":15,"sheets":["Disclaimer","Instructions","Summary","Intel Chassis","Serverboard Config","Serverboard","Chassis","Processors","Memory","PCI","HSBP","HardDrive","Peripherals","Macro1","Revisions"],"not_rendered":{"charts":0,"images":2,"macros":1,"external_links":1,"defined_names":69,"comments":0,"pivot_tables":0},"unopened":[],"bounds":{"document_bytes":16777216,"sheet_cells":100000,"rows_first":2000,"rows_last":500,"rows_between":2000,"halvings":0,"cell_chars":16384,"cell_head_chars":4096},"cells_cut":0,"cells_raw":0,"read":"whole","date_system":"1900"}

{"sheet":"Disclaimer","index":0,"n_rows":0,"n_cols":0,"rows_kept":0,"cut":false,"hidden":false,"merged":[]}

{"sheet":"Instructions","index":1,"n_rows":40,"n_cols":1,"rows_kept":40,"cut":false,"hidden":false,"merged":[]}
["        Power Budget Instructions"]
[]
[]
[]
[]
[]
[]
[]
[]
[]
[]
[]
[]
[]
[]
[]
[]
[]
[]
[]
[]
[]
[]
[]
[]
[]
[]
[]
[]
[]
[]
[]
[]
[]
[]
[]
[]
[]
[]
["Press the Start button to begin using the Power Budget Tool"]

{"sheet":"Summary","index":2,"n_rows":21,"n_cols":8,"rows_kept":21,"cut":false,"hidden":false,"merged":[[32,1,40,1],[0,1,0,6],[1,0,1,1],[2,0,2,1],[26,3,26,7],[27,1,31,1]]}
["Power Budget",{"$f":"CONCATENATE(INDEX(Chassis!$I$3:$I$16,'Intel Chassis'!$B3),\" / \",INDEX(Serverboard!A$2:A$7,'Serverboard Config'!$B5) )","v":"P4XXXXXMHJC / Intel® Server Board S2600CO/COE"}]
["Chassis/ Power Supply / Cooling:",null,{"$f":"INDEX(Chassis!A$3:A$15,'Intel Chassis'!$B3)","v":"1200W Red(2) P4XXXXXMHJC (high current PDB)"}]
["Serverboard:",null,{"$f":"INDEX(Serverboard!A$2:A$7,'Serverboard Config'!$B5)","v":"Intel® Server Board S2600CO/COE"}]
["System Totals","+3.3V (amps)","+5V (amps)"," +12V\n(amps)"," -12V (amps)","5VSB (amps)","Total System Watts "]
[{"$f":"CONCATENATE(\"Processors - Qty \",'Serverboard Config'!C4, \":\")","v":"Processors - Qty 2:"},{"$f":"SUM('Serverboard Config'!D3)","v":0},{"$f":"SUM('Serverboard Config'!E3)","v":0},{"$f":"SUM('Serverboard Config'!F3)","v":21.924603174603178},{"$f":"SUM('Serverboard Config'!G3)","v":0},{"$f":"SUM('Serverboard Config'!H3)","v":0},{"$f":"SUM('Serverboard Config'!I3)","v":263.09523809523813}]
[{"$f":"CONCATENATE(\"PCIe Cards - Qty \",('Serverboard Config'!B8>1) + ('Serverboard Config'!B9>1) + ('Serverboard Config'!B10>1) + ('Serverboard Config'!B11>1) +('Serverboard Config'!B12>1),\":\")","v":"PCIe Cards - Qty 3:"},{"$f":"SUM('Serverboard Config'!D7:D13)","v":6.86},{"$f":"SUM('Serverboard Config'!E7:E13)","v":0},{"$f":"SUM('Serverboard Config'!F7:F13)","v":36.449999999999996},{"$f":"SUM('Serverboard Config'!G7:G13)","v":0},{"$f":"SUM('Serverboard Config'!H7:H13)","v":0.3},{"$f":"SUM('Serverboard Config'!I7:I13)","v":461.53799999999995}]
[{"$f":"CONCATENATE(\"Hard Drives - Qty \",'Intel Chassis'!C4,\":\")","v":"Hard Drives - Qty 8:"},{"$f":"SUM('Intel Chassis'!D4:D4)","v":0},{"$f":"SUM('Intel Chassis'!E4:E4)","v":0},{"$f":"SUM('Intel Chassis'!F4:F4)","v":6.6550000000000002},{"$f":"SUM('Intel Chassis'!G4:G4)","v":0},0,{"$f":"SUM('Intel Chassis'!I4:I4)","v":79.86}]
["Serverboard & Memory:",{"$f":"SUM('Serverboard Config'!D5:D6)","v":1.3680000000000001},{"$f":"SUM('Serverboard Config'!E5:E6)","v":2},{"$f":"SUM('Serverboard Config'!F5:F6)","v":15.808479999999998},{"$f":"SUM('Serverboard Config'!G5:G6)","v":0},{"$f":"SUM('Serverboard Config'!H5:H6)","v":0.41499999999999998},{"$f":"SUM('Serverboard Config'!I5:I6)","v":206.29115999999999}]
["Chassis & Peripherals:",{"$f":"SUM('Intel Chassis'!D3:D10)-SUM('Intel Chassis'!D4:D4)","v":0},{"$f":"SUM('Intel Chassis'!E3:E10)-SUM('Intel Chassis'!E4:E4)","v":0.9},{"$f":"SUM('Intel Chassis'!F3:F7)-SUM('Intel Chassis'!F4:F4)","v":5.202588235294118},{"$f":"SUM('Intel Chassis'!G3:G10)-SUM('Intel Chassis'!G4:G4)","v":0},{"$f":"SUM('Intel Chassis'!H3:H10)-SUM('Intel Chassis'!H4:H4)","v":0},{"$f":"'Intel Chassis'!I12-'Intel Chassis'!I4","v":75.331058823529432}]
["System Totals:",{"$f":"SUM(B5:B9)","v":8.2279999999999998},2.9,86.040671409897286,0,0.71499999999999997,1086.1154569187674]
["Power Supply Limits:",{"$f":"INDEX(Chassis!B$3:B$16,'Intel Chassis'!$B3)","v":25},{"$f":"INDEX(Chassis!C$3:C$16,'Intel Chassis'!$B3)","v":25},{"$f":"INDEX(Chassis!D$3:D$16,'Intel Chassis'!$B3)","v":100},{"$f":"INDEX(Chassis!E$3:E$16,'Intel Chassis'!$B3)","v":0.5},{"$f":"INDEX(Chassis!F$3:F$16,'Intel Chassis'!$B3)","v":4.28},{"$f":"INDEX(Chassis!G$3:G$16,'Intel Chassis'!$B3)","v":1200}]
["Margins to Limit:",{"$f":"B11-B10","v":16.771999999999998},22.1,13.959328590102714,0.5,3.5650000000000004,113.88454308123255,{"$f":"IF(OR(OR(OR(B12<0,C12<0),OR(D12<0,E12<0)),G12<0),\"<-- Limits Exceeded!\",\"\")","v":""}]
[{"$f":"IF((G11=550), \"550W PSU +12V rail will have config limitation, see below config table for details.\", \"Please note +12V rail OCP\")","v":"Please note +12V rail OCP"}]
["Negative margins show configuration exceeds a specified limit."]
[]
[]
[null,null,null,null,null,"110V","220V"]
[null,null,null,null,"Estimated Worst Case Inlet Power:",{"$f":"PowerTotal/ (INDEX(Chassis!$J$3:$J$16,'Intel Chassis'!$B3)+0.001)","v":1355.9493844179369},{"$f":"PowerTotal / (INDEX(Chassis!$K$3:$K$16,'Intel Chassis'!$B3)+0.001)","v":1355.9493844179369}," (Watts)"]
[null,null,null,null,"Estimated Worst Case Inlet Current:",{"$f":"F18/110","v":12.326812585617608},{"$f":"G18/220","v":6.163406292808804}," (Amps)"]
[null,null,null,null,"Estimated Worst Case Thermal Dissipation:",{"$f":"F18*3.41","v":4623.7874008651652},{"$f":"G18*3.41","v":4623.7874008651652}," (BTU/Hr)"]
[{"$f":"Revisions!A1","v":"Version 1.0 - 6/10/2011"}]

{"sheet":"Intel Chassis","index":3,"n_rows":16,"n_cols":10,"rows_kept":16,"cut":false,"hidden":false,"merged":[[0,1,0,5]]}
["Power Budget",{"$f":"CONCATENATE(INDEX(Chassis!$I$3:$I$16,B3), \" System Configuration\")","v":"P4XXXXXMHJC System Configuration"}]
["System Feature","Description","Qty","+3.3V (amps)","+5V (amps)"," +12V(amps)","-12V\n(amps)"," 5V stby (amps)","Power\n(watts)"]
["Chassis:",2,null,null,null,{"$f":"INDEX(Chassis!$H$4:$H$21,B3)","v":5},null,null,{"$f":"D3*3.3+E3*5+(F3+G3)*12+H3*5","v":60},"Includes System Fans"]
["Hotswap Hard Drives: ",3,8,null,null,{"$f":"(INDEX(HardDrive!$D$2:$D$13,B4))*C4+(INDEX(HardDrive!$C$2:$C$13,B4) *C4)*5/0.8/12","v":6.6550000000000002},null,null,79.86]
["Midplane / HSBP (Backplane)",3,1,null,null,{"$f":"INDEX(HSBP!D2:D9,$B5) *$C5","v":0.20258823529411762},null,null,2.4310588235294115]
["Fixed Hard Drives:",5,0,null,{"$f":"INDEX(HardDrive!$C$2:$C$13,B6) *C6","v":0},{"$f":"(INDEX(HardDrive!$D$2:$D$13,B6))*C6","v":0},null,null,0]
["USB: ","USB Devices (100mA/device)",5,null,{"$f":"0.1*C7","v":0.5},null,null,null,2.5]
["External Bay 1:",2,1,{"$f":"INDEX(Peripherals!B$3:B$8,$B8) *$C8","v":0},{"$f":"INDEX(Peripherals!C$3:C$8,$B8) *$C8","v":0.4},{"$f":"INDEX(Peripherals!D$3:D$8,$B8) *$C8","v":0.7},null,{"$f":"INDEX(Peripherals!E$3:E$8,$B8) *$C8","v":0},10.399999999999999]
["External Bay 2:",1,0,{"$f":"INDEX(Peripherals!B$3:B$8,$B9) *$C9","v":0},{"$f":"INDEX(Peripherals!C$3:C$8,$B9) *$C9","v":0},{"$f":"INDEX(Peripherals!D$3:D$8,$B9) *$C9","v":0},null,{"$f":"INDEX(Peripherals!E$3:E$8,$B9) *$C9","v":0},0]
["External Bay 3: ",1,0,{"$f":"INDEX(Peripherals!B$3:B$8,$B10) *$C10","v":0},{"$f":"INDEX(Peripherals!C$3:C$8,$B10) *$C10","v":0},{"$f":"INDEX(Peripherals!D$3:D$8,$B10) *$C10","v":0},null,{"$f":"INDEX(Peripherals!E$3:E$8,$B10) *$C10","v":0},0]
[]
[null,"Subtotal System (A):",null,{"$f":"SUM(D3:D10)","v":0},0.9,12.557588235294117,0,0,155.19105882352943]
[null,"Total System usage (A):",null,{"$f":"Summary!B10","v":8.2279999999999998},{"$f":"Summary!C10","v":2.9},{"$f":"Summary!D10","v":86.040671409897286},{"$f":"Summary!E10","v":0},{"$f":"Summary!F10","v":0.71499999999999997},{"$f":"Summary!G10","v":1086.1154569187674}]
[null,"Power Supply Limits (A):",null,{"$f":"Summary!B11","v":25},{"$f":"Summary!C11","v":25},{"$f":"Summary!D11","v":100},{"$f":"Summary!E11","v":0.5},{"$f":"Summary!F11","v":4.28},{"$f":"Summary!G11","v":1200}]
[null,"Margins compared to Limits:",null,{"$f":"Summary!B12","v":16.771999999999998},{"$f":"Summary!C12","v":22.1},{"$f":"Summary!D12","v":13.959328590102714},{"$f":"Summary!E12","v":0.5},{"$f":"Summary!F12","v":3.5650000000000004},{"$f":"Summary!G12","v":113.88454308123255},{"$f":"IF(OR(OR(L100<0,E15<0),OR(F15<0,I15<0)),\"<-- Limits Exceeded!\",\"<--System Margins\")","v":"<--System Margins"}]
["System Margins so far:",null,null,"3.3V","5V","12V","12V","12V","W"]

{"sheet":"Serverboard Config","index":4,"n_rows":18,"n_cols":11,"rows_kept":18,"cut":false,"hidden":false,"merged":[[0,1,0,8]]}
["Power Budget",{"$f":"CONCATENATE(INDEX(Serverboard!A$2:A$7,$B5),\" Serverboard Configuration\")","v":"Intel® Server Board S2600CO/COE Serverboard Configuration"},null,null,null,null,null,null,null,null,"VRM Efficiency"]
["Serverboard Feature","Description",null,"+3.3V (amps)","+5V (amps)"," +12V(amps)"," -12V (amps)","5V \nstby (amps)","Power (watts)",null,0.84]
["Processors:",4,null,null,null,{"$f":"IF(C4=1,INDEX(Processors!B$2:B$24,$B3)/12/VRMefficiency,C4*INDEX(Processors!B$2:B$24,$B3)*0.85/12/VRMefficiency)","v":21.924603174603178},null,null,{"$f":"F3*12+E3*5","v":263.09523809523813},"*This line includes correction factors."]
[null,"Quantity:",2]
["Serverboard:",2,null,{"$f":"INDEX(Serverboard!B$2:B$7,$B5)","v":1.3680000000000001},{"$f":"INDEX(Serverboard!C$2:C$7,$B5)","v":2},{"$f":"INDEX(Serverboard!D$2:D$7,$B5)","v":1.6},{"$f":"INDEX(Serverboard!E$2:E$7,$B5)","v":0},{"$f":"INDEX(Serverboard!F$2:F$7,$B5)","v":0.41499999999999998},{"$f":"INDEX(Serverboard!G$2:G$7,$B5)","v":35.789400000000008}]
["Memory:",7,9,null,null,{"$f":"INDEX(Memory!D$2:D$13,$B6)*INDEX(Memory!A$26:A$38,$C6)*0.9*0.78","v":14.208479999999998},null,null,{"$f":"D6*3.3+E6*5+F6*12+G6*12+H6*5","v":170.50175999999999},"*This line includes correction factors (utilization & VR eff)."]
[]
["PCI Slot 1",5,null,{"$f":"INDEX(PCI!B$2:B$14,$B8)","v":3},{"$f":"INDEX(PCI!C$2:C$14,$B8)","v":0},{"$f":"INDEX(PCI!D$2:D$14,$B8)","v":17.95},{"$f":"INDEX(PCI!E$2:E$14,$B8)","v":0},{"$f":"INDEX(PCI!F$2:F$14,$B8)","v":0},{"$f":"D8*3.3+E8*5+F8*12+G8*12+H8*5","v":225.29999999999998}]
["PCI Slot 2",1,null,{"$f":"INDEX(PCI!B$2:B$14,$B9)","v":0},{"$f":"INDEX(PCI!C$2:C$14,$B9)","v":0},{"$f":"INDEX(PCI!D$2:D$14,$B9)","v":0},{"$f":"INDEX(PCI!E$2:E$14,$B9)","v":0},{"$f":"INDEX(PCI!F$2:F$14,$B9)","v":0},0]
["PCI Slot 3",5,null,{"$f":"INDEX(PCI!B$2:B$14,$B10)","v":3},{"$f":"INDEX(PCI!C$2:C$14,$B10)","v":0},{"$f":"INDEX(PCI!D$2:D$14,$B10)","v":17.95},{"$f":"INDEX(PCI!E$2:E$14,$B10)","v":0},{"$f":"INDEX(PCI!F$2:F$14,$B10)","v":0},225.29999999999998]
["PCI Slot 4",1,null,{"$f":"INDEX(PCI!B$2:B$14,$B11)","v":0},{"$f":"INDEX(PCI!C$2:C$14,$B11)","v":0},{"$f":"INDEX(PCI!D$2:D$14,$B11)","v":0},{"$f":"INDEX(PCI!E$2:E$14,$B11)","v":0},{"$f":"INDEX(PCI!F$2:F$14,$B11)","v":0},0]
["PCI Slot 5",9,null,{"$f":"INDEX(PCI!B$2:B$14,$B12)","v":0.86},{"$f":"INDEX(PCI!C$2:C$14,$B12)","v":0},{"$f":"INDEX(PCI!D$2:D$14,$B12)","v":0.55000000000000004},{"$f":"INDEX(PCI!E$2:E$14,$B12)","v":0},{"$f":"INDEX(PCI!F$2:F$14,$B12)","v":0.3},10.938000000000001]
["PCI Slot 6",1,null,{"$f":"INDEX(PCI!B$2:B$14,$B13)","v":0},{"$f":"INDEX(PCI!C$2:C$14,$B13)","v":0},{"$f":"INDEX(PCI!D$2:D$14,$B13)","v":0},{"$f":"INDEX(PCI!E$2:E$14,$B13)","v":0},{"$f":"INDEX(PCI!F$2:F$14,$B13)","v":0},0]
[null,"SubTotals (A):",null,{"$f":"SUM(D3:D13)","v":8.2279999999999998},{"$f":"SUM(E3:E13)","v":2},{"$f":"SUM(F3:F13)","v":74.183083174603183},{"$f":"SUM(G3:G13)","v":0},{"$f":"SUM(H3:H13)","v":0.71499999999999997}]
[null,"SubTotal Serverboard Power (W):",null,{"$f":"(D14)*3.3","v":27.152399999999997},{"$f":"(E14)*5","v":10},{"$f":"(F14)*12","v":890.1969980952382},{"$f":"(G14)*12","v":0},{"$f":"(H14)*5","v":3.5749999999999997},{"$f":"SUM(D15:H15)","v":930.9243980952383}]
[null,"Total System usage (A):",null,{"$f":"Summary!B10","v":8.2279999999999998},{"$f":"Summary!C10","v":2.9},{"$f":"Summary!D10","v":86.040671409897286},{"$f":"Summary!E10","v":0},{"$f":"Summary!F10","v":0.71499999999999997},{"$f":"Summary!G10","v":1086.1154569187674}]
[null,"Power Supply Limits (A):",null,{"$f":"Summary!B11","v":25},{"$f":"Summary!C11","v":25},{"$f":"Summary!D11","v":100},{"$f":"Summary!E11","v":0.5},{"$f":"Summary!F11","v":4.28},{"$f":"Summary!G11","v":1200}]
[null,null,"Margin compared to Limits:",{"$f":"Summary!B12","v":16.771999999999998},{"$f":"Summary!C12","v":22.1},{"$f":"Summary!D12","v":13.959328590102714},{"$f":"Summary!E12","v":0.5},{"$f":"Summary!F12","v":3.5650000000000004},{"$f":"Summary!G12","v":113.88454308123255},{"$f":"IF(OR(OR(OR(D18<0,E18<0),OR(F18<0,G18<0)),A18<0),\"<-- Limits Exceeded!\",\"<--System Margins\")","v":"<--System Margins"}]

{"sheet":"Serverboard","index":5,"n_rows":7,"n_cols":8,"rows_kept":7,"cut":false,"hidden":false,"merged":[]}
["Serverboard",3.3,5,"12V",-12,"5VSB","W"]
["(Select Serverboard)",null,null,null,null,null,{"$f":"B2*3.3+C2*5+D2*12+E2*12 + F2*5","v":0}]
["Intel® Server Board S2600CO/COE",1.3680000000000001,2,1.6,0,0.41499999999999998,35.789400000000008]
[null,null,null,null,null,null,0,"<-- Define Custom Numbers Here"]
[null,null,null,null,null,null,0,"<-- Define Custom Numbers Here"]
["User Definable",null,null,null,null,null,0,"<-- Define Custom Numbers Here"]
["User Definable",null,null,null,null,null,0,"<-- Define Custom Numbers Here"]

{"sheet":"Chassis","index":6,"n_rows":19,"n_cols":12,"rows_kept":19,"cut":false,"hidden":false,"merged":[[0,1,0,6]]}
["Chassis","Power supply limits",null,null,null,null,null,"Fans","Product Name","PS Efficiency","PS Efficiency"]
["Selection","3V","5V","12V"," -12V","5VSB","Watts",null,null,"110V","220V"]
["(Select a Chassis)",null,null,null,null,null,null,null,"(Select Chassis)"]
["1200W Red(2) P4XXXXXMHJC (high current PDB)",25,25,{"$f":"1200/12","v":100},0.5,4.28,1200,5,"P4XXXXXMHJC",0.8,0.8]
["750W Red(2) P4XXXXXMHGC (high current PDB)",25,25,{"$f":"750/12","v":62.5},0.5,4.28,750,5,"P4XXXXXMHGC",0.8,0.8]
["750W Red(2) P4XXXXXMHGR (high current PDB)",25,25,{"$f":"750/12","v":62.5},0.5,4.28,750,5,"P4XXXXXMHGR",0.8,0.8]
["750W Red(2)   P4XXXXXMFGR (high current PDB)",25,25,{"$f":"750/12","v":62.5},0.5,4.28,750,5,"P4XXXXXMFGR",0.8,0.8]
["750W (1)   P4XXXXXMHGN (high current PDB)",25,25,{"$f":"750/12","v":62.5},0.5,4.28,750,5,"P4XXXXXMHGN",0.8,0.8]
["750W (1)   P4XXXXXMFGN (high current PDB)",25,25,{"$f":"750/12","v":62.5},0.5,4.28,750,5,"P4XXXXXMFGN",0.8,0.8]
["460W Red(2)   P4XXXXXMFDR (low current PDB)",25,25,{"$f":"460/12","v":38.333333333333336},0.5,4.28,460,5,"P4XXXXXMFDR",0.78,0.78]
["460W Red(2)   P4XXXXXMHDR (low current PDB)",25,25,{"$f":"460/12","v":38.333333333333336},0.5,4.28,460,5,"P4XXXXXMHDR",0.78,0.78]
["460W (1)   P4XXXXXMFDN (low current PDB)",25,25,{"$f":"460/12","v":38.333333333333336},0.5,4.28,460,5,"P4XXXXXMFDN",0.78,0.78]
["460W (1)   P4XXXXXMHDN (low current PDB)",25,25,{"$f":"460/12","v":38.333333333333336},0.5,4.28,460,5,"P4XXXXXMHDN",0.78,0.78]
["550W Fixed   P4XXXXXMFEN",18,15,66,0.5,3,550,5,"P4XXXXXMFEN",0.88,0.88]
["550W Fixed   P4XXXXXMHEN",18,15,66,0.5,3,550,5,"P4XXXXXMHEN",0.88,0.88]
[null,null,null,null,null,null,null,null,null,null,null,"<-- Define Custom Numbers Here"]
[null,null,null,null,null,null,null,null,null,null,null,"<-- Define Custom Numbers Here"]
[null,null,null,null,null,null,null,null,null,null,null,"<-- Define Custom Numbers Here"]
[null,null,null,null,null,null,null,null,null,null,null,"<-- Define Custom Numbers Here"]

{"sheet":"Processors","index":7,"n_rows":29,"n_cols":6,"rows_kept":29,"cut":false,"hidden":false,"merged":[]}
["Processor Types","TDP (W)","Source",null,"VRM#1","VRM#2"]
["(Select a Processor)",null,null,null,"5V VRM","12V VRM"]
["E5-2687W (8C, C0, 150W, 3.1Ghz)",150]
["E5-2690 (8C, C0, 135W, 2.9Ghz)",135]
["E5-2680 (8C, C0, 130W, 2.7Ghz)",130,null,null,"None"]
["E5-2670 (8C, C0, 115W, 2.6Ghz)",115]
["E5-2667 (6C, C0, 130W, 2.9Ghz)",130]
["E5-2665 (8C, C0, 115W, 2.4Ghz)",115]
["E5-2660 (8C, C0, 95W, 2.2Ghz)",95]
["E5-2640 (6C, C0, 95W, 2.5Ghz)",95]
["E5-2650L (8C, C0, 70W, 1.8Ghz)",70]
["E5-2630 (6C, C0, 95W, 2.3Ghz)",95]
["E5-2630L (6C, C0, 60W, 2.0Ghz)",60]
["E5-2620 (6C, C0, 95W, 2.0Ghz)",95]
["User Definable",null,null,"<-- Define Custom Numbers Here"]
["User Definable",null,null,"<-- Define Custom Numbers Here"]
["User Definable",null,null,"<-- Define Custom Numbers Here"]
["User Definable",null,null,"<-- Define Custom Numbers Here"]
["User Definable",null,null,"<-- Define Custom Numbers Here"]
["User Definable",null,null,"<-- Define Custom Numbers Here"]
["User Definable",null,null,"<-- Define Custom Numbers Here"]
["User Definable",null,null,"<-- Define Custom Numbers Here"]
["User Definable",null,null,"<-- Define Custom Numbers Here"]
[null,null,null,"<-- Define Custom Numbers Here"]
[]
[]
["Processor Quantities (used for tool operation)"]
[1,1]
[2,2]

{"sheet":"Memory","index":8,"n_rows":34,"n_cols":7,"rows_kept":34,"cut":false,"hidden":false,"merged":[]}
["Memory","+3.3V","+5V","+12V","-12V","Watts"]
["(Select Memory)",null,null,null,null,{"$f":"B2*3.3+C2*5+D2*12","v":0}]
["DDR3 UDIMMs (4Gb,DR,x8,1600)",null,null,0.42499999999999999,null,5.0999999999999996]
["DDR3 UDIMMs (4Gb,DR,x4,1600)",null,null,0.42499999999999999,null,{"$f":"B4*3.3+C4*5+D4*12","v":5.0999999999999996}]
["DDR3 RDIMMs (2Gb,QR,x4,800)",null,null,1.07,null,{"$f":"B5*3.3+C5*5+D5*12","v":12.84}]
["DDR3 RDIMMs (2Gb,QR,x4,1067)",null,null,0.89500000000000002,null,{"$f":"B6*3.3+C6*5+D6*12","v":10.74}]
["DDR3 LR-DIMMs (4Gb,QR,x4,1333)",null,null,1.0449999999999999,null,{"$f":"B7*3.3+C7*5+D7*12","v":12.54}]
["DDR3 LR-DIMMs (4Gb,QR,x4,1067)",null,null,1.2649999999999999,null,{"$f":"B8*3.3+C8*5+D8*12","v":15.18}]
["DDR3 LR-DIMMs (4Gb,QR,x4,1600)",null,null,{"$f":"14.3/12","v":1.1916666666666667},null,14.3,"<-- Define Custom Numbers Here"]
["User Definable",null,null,null,null,0,"<-- Define Custom Numbers Here"]
["User Definable",null,null,null,null,0,"<-- Define Custom Numbers Here"]
["User Definable",null,null,null,null,0,"<-- Define Custom Numbers Here"]
["User Definable",null,null,null,null,0,"<-- Define Custom Numbers Here"]
[]
[]
[]
["Note:"]
[]
[]
[]
[]
[]
[]
[]
["Memory  Quantities (used for tool operation)"]
[0]
[1]
[2]
[4]
[6]
[8]
[10]
[12]
[16]

{"sheet":"PCI","index":9,"n_rows":14,"n_cols":8,"rows_kept":14,"cut":false,"hidden":false,"merged":[]}
["PCIe Add in Cards","+3.3V (A)","+5V (A)","+12V3 (A)","-12V (A)"," 5vsb (A)","W"]
["Slot Empty",0,0,0,0,0,{"$f":"E2*(-12)+D2*12+C2*5+B2*3.3","v":0}]
["PCIe (3.3V / 12V) Typical 10W",2,null,0.25,null,null,{"$f":"F3*5+E3*(12)+D3*12+C3*5+B3*3.3","v":9.6}]
["PCIe (3.3V / 12V) High 15W",2,null,0.65,null,null,14.4]
["PCIe GPGPU 300W",3,null,24.18,null,null,300.05999999999995]
["PCIe GPGPU 225W",3,null,17.95,null,null,225.29999999999998]
["PCIe GPU 150W",3,null,11.68,null,null,150.06]
["General GPU 75W",3,null,5.43,null,null,75.06]
["Intel RAID controller RMS25XXXXX",0.86,null,0.55000000000000004,null,0.3,{"$f":"F9*5+E9*(12)+D9*12+C9*5+B9*3.3","v":10.938000000000001},"<-- Define Custom Card Here"]
["Intel RAID controller RMT25XXXXX",0.86,null,0.55000000000000004,null,0.3,10.938000000000001,"<-- Define Custom Card Here"]
["Intel 24-port Expander RES2SV240",null,null,0.97,null,null,{"$f":"F11*5+E11*(12)+D11*12+C11*5+B11*3.3","v":11.64},"<-- Define Custom Card Here"]
["PCI User Definable ",null,null,null,null,null,0,"<-- Define Custom Card Here"]
["PCI User Definable ",null,null,null,null,null,{"$f":"F13*5+E13*(12)+D13*12+C13*5+B13*3.3","v":0},"<-- Define Custom Card Here"]
["PCI User Definable ",null,null,null,null,null,0,"<-- Define Custom Card Here"]

{"sheet":"HSBP","index":10,"n_rows":63,"n_cols":9,"rows_kept":63,"cut":false,"hidden":false,"merged":[]}
["Backplane / Midplane","+3.3V (A)","+5V (A)","+12V3 (A)","-12V (A)"," 5vsb (A)","W"]
["Select Backplane or Midplane",0,0,0,0,0,{"$f":"E2*(-12)+D2*12+C2*5+B2*3.3","v":0}]
["4U 8x 3.5\" HSBP",null,null,{"$f":"F32","v":0.20258823529411762},null,null,{"$f":"F3*5+E3*(12)+D3*12+C3*5+B3*3.3","v":2.4310588235294115}]
["4U 8x 2.5\" HSBP",null,null,{"$f":"F48","v":0.20258823529411762},null,null,2.4310588235294115]
["4U 4x 3.5\" HSBP",null,null,{"$f":"F63","v":0.20258823529411762},null,null,2.4310588235294115]
["User Definable",null,null,null,null,null,0,"<-- Define Custom Card Here"]
["User Definable",null,null,null,null,null,0,"<-- Define Custom Card Here"]
["User Definable",null,null,null,null,null,0,"<-- Define Custom Card Here"]
["User Definable",null,null,null,null,null,0,"<-- Define Custom Card Here"]
[]
[]
[]
[]
[]
[]
[]
[]
[]
[]
["4U 8x3.5 HSBP"]
["Function","Sch Page","P3V3, Max","5V, Max","12V, Max","Comments:",null,"5V, Max","12V, Max"]
["3.5\" SATA/SAS HDD",null,null,null,null,"No derating, doesn't include spinup power",null,6.4,8.8000000000000007]
["3.3V LR (from 5V)",null,null,0.24299999999999999,null,"MIC69153, up to 0.8A load current, 66% efficiency"]
["Reset Timer",null,0.02,null,null,"ADM809"]
["FRU EEPROM",null,5.0000000000000001E-3,null,null,"AT24C64"]
["Temp Sensor",null,0.01,null,null,"TMP75"]
["SPI Flash",null,0.03,null,null,"SST25LF080A"]
["HSBP Microcontroller",null,5.5E-2,null,null,"PSoC"]
["LED drivers (Act/Fault)",null,0.1,null,null,"74LVC07, Assumes 10mA per LED"]
["Misc Pullups",null,3.7999999999999999E-2]
["Total Current, A",null,{"$f":"SUM(C22:C30)","v":0.25800000000000001},{"$f":"SUM(D22:D30)","v":0.24299999999999999},{"$f":"SUM(E22:E30)","v":0}]
["Total Power, W",null,{"$f":"C31*3.3","v":0.85139999999999993},{"$f":"D31*5","v":1.2149999999999999},{"$f":"E31*12","v":0},{"$f":"(C32/0.85+D32/0.85+E32)/12","v":0.20258823529411762}]
[]
[]
["4U 8x2.5 HSBP"]
["Function","Sch Page","P3V3, Max","5V, Max","12V, Max","Comments:",null,"5V, Max","12V, Max"]
["2.5\" SATA/SAS HDD",null,null,null,null,"No derating, doesn't include spinup power",null,6.4,3.2]
["5V Switcher (from 12V)",null,null,null,null,"SC417, ~90% estimated efficiency",null,null,3.0760000000000001]
["3.3V LR (from 5V)",null,null,0.24299999999999999,null,"MIC69135, up to 0.8A load current, 66% efficiency"]
["Reset Timer",null,0.02,null,null,"ADM809"]
["FRU EEPROM",null,5.0000000000000001E-3,null,null,"AT24C64"]
["Temp Sensor",null,0.01,null,null,"TMP75"]
["SPI Flash",null,0.03,null,null,"SST25LF080A"]
["HSBP Microcontroller",null,5.5E-2,null,null,"PSoC"]
["LED drivers (Act/Fault)",null,0.1,null,null,"74LVC07, Assumes 10mA per LED"]
["Misc Pullups",null,3.7999999999999999E-2]
["Total Current, A",null,{"$f":"SUM(C37:C46)","v":0.25800000000000001},{"$f":"SUM(D37:D46)","v":0.24299999999999999},{"$f":"SUM(E37:E46)","v":0}]
["Total Power, W",null,{"$f":"C47*3.3","v":0.85139999999999993},{"$f":"D47*5","v":1.2149999999999999},{"$f":"E47*12","v":0},{"$f":"(C48/0.85+D48/0.85+E48)/12","v":0.20258823529411762}]
[]
[]
["4U 4x3.5 HSBP"]
["Function","Sch Page","P3V3, Max","5V, Max","12V, Max","Comments:",null,"5V, Max","12V, Max"]
["3.5\" SATA/SAS HDD",null,null,null,null,"No derating, doesn't include spinup power",null,3.2,4.4000000000000004]
["3.3V LR (from 5V)",null,null,0.24299999999999999,null,"MIC69153, up to 0.8A load current, 66% efficiency"]
["Reset Timer",null,0.02,null,null,"ADM809"]
["FRU EEPROM",null,5.0000000000000001E-3,null,null,"AT24C64"]
["Temp Sensor",null,0.01,null,null,"TMP75"]
["SPI Flash",null,0.03,null,null,"SST25LF080A"]
["HSBP Microcontroller",null,5.5E-2,null,null,"PSoC"]
["LED drivers (Act/Fault)",null,0.1,null,null,"74LVC07, Assumes 10mA per LED"]
["Misc Pullups",null,3.7999999999999999E-2]
["Total Current, A",null,{"$f":"SUM(C53:C61)","v":0.25800000000000001},{"$f":"SUM(D53:D61)","v":0.24299999999999999},{"$f":"SUM(E53:E61)","v":0}]
["Total Power, W",null,{"$f":"C62*3.3","v":0.85139999999999993},{"$f":"D62*5","v":1.2149999999999999},{"$f":"E62*12","v":0},{"$f":"(C63/0.85+D63/0.85+E63)/12","v":0.20258823529411762}]

{"sheet":"HardDrive","index":11,"n_rows":13,"n_cols":6,"rows_kept":13,"cut":false,"hidden":false,"merged":[]}
["Hard Drives","Amps of +3.3V","Amps of +5V","Amps of +12V3","W"]
["Empty",null,null,null,{"$f":"C2*5+D2*12","v":0}]
["3.5\"SAS Typical Power (15W)",null,0.8,0.92,15.040000000000001]
["2.5\" SAS Typical Power (9W)",null,0.81,0.41,8.9700000000000006]
["Seagate SAS 10K Savvio ST9146802SS",null,0.79,0.39,8.629999999999999]
["Seagate SAS 15K Savvio ST973451SS",null,0.72,0.36,7.92]
["User Definable",null,null,null,0,"<-- Define Custom Device Here"]
["3.5\" SATA Typical Power (12W)",null,0.5,0.8,12.100000000000001,"<-- Define Custom Device Here"]
["2.5\" SATA Typical Power (5W)",null,1,0,5,"<-- Define Custom Device Here"]
["Fujitsu SATA MHV2080BS",null,1,0,5,"<-- Define Custom Device Here"]
["Intel® X25-E SATA Solid State Drive",null,0.52,0,2.6,"<-- Define Custom Device Here"]
["User Definable",null,null,null,0,"<-- Define Custom Device Here"]
["User Definable",null,null,null,0,"<-- Define Custom Device Here"]

{"sheet":"Peripherals","index":12,"n_rows":8,"n_cols":7,"rows_kept":8,"cut":false,"hidden":false,"merged":[]}
["Misc Peripherals","Amps of +3.3V","Amps of +5V","Amps of +12V","Amps of 5vsb","Watts"]
["ODD Bay Devices:"]
["Empty"]
["DVDROM",null,0.4,0.7,null,{"$f":"B4*3.3+C4*5+D4*12+E4*5","v":10.399999999999999}]
["USB floppy drive",null,0.5,null,null,{"$f":"B5*3.3+C5*5+D5*12+E5*5","v":2.5}]
["Tape Drive",null,0.77,0.4,null,{"$f":"B6*3.3+C6*5+D6*12+E6*5","v":8.65}]
["User Definable",null,null,null,null,{"$f":"B7*3.3+C7*5+D7*12+E7*5","v":0},"<-- Define Custom Peripherals Here"]
["User Definable",null,null,null,null,{"$f":"B8*3.3+C8*5+D8*12+E8*5","v":0},"<-- Define Custom Peripherals Here"]

{"sheet":"Macro1","index":13,"n_rows":0,"n_cols":0,"rows_kept":0,"cut":false,"hidden":false,"merged":[]}

{"sheet":"Revisions","index":14,"n_rows":4,"n_cols":4,"rows_kept":4,"cut":false,"hidden":false,"merged":[]}
["Version 1.0 - 6/10/2011","<=== Linked to Summary Tab."]
[]
["Date","Rev","Notes","Init"]
["2011-06-10",1,"Initial Release","DS1"]