{"text_format":"1","workbook":"xlsx","n_sheets":16,"sheets":["Disclaimer","Instructions","Normal Config","Fan Fail Config","Summary","Intel Chassis","Serverboard Config","Serverboard","Chassis","Processors","Memory","DCPMM","PCI","HardDrive","Peripherals","Revision"],"not_rendered":{"charts":0,"images":5,"macros":1,"external_links":0,"defined_names":159,"comments":2,"pivot_tables":0},"unopened":[],"bounds":{"document_bytes":16777216,"sheet_cells":100000,"rows_first":2000,"rows_last":500,"rows_between":2000,"halvings":0,"cell_chars":16384,"cell_head_chars":4096},"cells_cut":0,"cells_raw":0,"read":"whole","date_system":"1900"}

{"sheet":"Disclaimer","index":0,"n_rows":0,"n_cols":0,"rows_kept":0,"cut":false,"hidden":false,"merged":[]}

{"sheet":"Instructions","index":1,"n_rows":1,"n_cols":1,"rows_kept":1,"cut":false,"hidden":false,"merged":[]}
["          Power Budget Instructions"]

{"sheet":"Normal Config","index":2,"n_rows":244,"n_cols":36,"rows_kept":244,"cut":false,"hidden":false,"merged":[[39,1,46,1],[132,0,134,0],[135,1,139,1],[135,0,194,0],[143,1,149,1],[150,1,152,1],[153,1,164,1],[165,1,167,1],[168,1,170,1],[182,1,185,1],[186,1,194,1],[140,1,141,1],[172,1,179,1],[89,0,93,0],[94,0,95,0],[94,1,95,1],[240,0,241,0],[242,0,243,0],[220,0,221,0],[222,0,223,0],[224,0,228,0],[230,0,234,0],[235,0,239,0],[195,0,200,0],[201,0,206,0],[207,0,208,0],[209,0,216,0],[217,0,219,0],[129,19,129,22],[129,23,129,26],[129,27,129,30],[130,0,131,0],[129,0,129,2],[129,3,129,6],[129,7,129,10],[129,11,129,14],[129,15,129,18],[96,0,97,0],[98,0,105,0],[64,0,69,0],[70,0,71,0],[72,0,79,0],[80,0,82,0],[83,0,87,0],[10,1,16,1],[0,0,0,1],[2,11,2,14],[6,0,8,0],[9,0,61,0],[17,1,19,1],[20,1,31,1],[32,1,34,1],[35,1,37,1],[49,1,52,1],[53,1,61,1],[2,0,2,2],[2,3,2,6],[2,7,2,10],[3,0,4,0],[6,1,8,1]]}
["Normal Mode Thermal Config Matrix",null,null,null,null,null,null,null,null,null,null,null,null,{"$f":"Summary!D15","v":{"$error":"#DIV/0!"}},"<-- Margin to PS rating"]
[]
["Thermal Config Matrix                                                                                           Normal operating mode                                                                                                                                                                                                                       \"●\"= Full Support without limitation;                                                                                                                                             \"4,5\"(Cell with number)=Conditional support with limitation (See notes below table);\n\" \"(Blank)=Not support; ",null,null," R1304 HDD WF",null,null,null,"R1208 HDD WF",null,null,null,"R1208 NVME WF"]
["ASHRAE (See note 1)",null,"Classifications","27C","A2","A3","A4","27C","A2","A3","A4","27C","A2","A3","A4"]
[null,null,"Max Ambient","27°C(1)","35°C","40°C","45°C","27°C(1)","35°C","40°C","45°C","27°C(1)","35°C","40°C","45°C"]
[null,null,"Altitude",900,900,900,900,900,900,900,900,900,900,900,900]
["PS (See note 6)",null,"1300 W AC","●",17,19,20,"●",18,19,20,"●","●","●","●"]
[null,null,"1100W AC","●","●","●","●","●","●","●","●","●","●","●","●"]
[null,null,"750W AC","17, 24","19, 24","20, 25",21,"17, 24","19, 24",20,21]
["CPU TDP","173 W","Intel Xeon Platinum 8176F _28C","●",null,null,null,"●",null,null,null,3]
{"$rows_left_out":235}
{"sheet":"Fan Fail Config","index":3,"n_rows":254,"n_cols":31,"rows_kept":254,"cut":false,"hidden":false,"merged":[[270,0,271,0],[272,0,273,0],[263,0,267,0],[268,0,269,0],[258,0,259,0],[139,15,139,18],[139,19,139,22],[139,23,139,26],[139,27,139,30],[139,0,139,2],[139,3,139,6],[139,7,139,10],[86,0,88,0],[89,0,93,0],[95,0,99,0],[75,0,76,0],[139,11,139,14],[1,3,1,6],[5,1,7,1],[38,1,45,1],[1,7,1,10],[1,11,1,14],[9,1,15,1],[16,1,18,1],[19,1,30,1],[31,1,33,1],[34,1,36,1],[252,0,253,0],[256,0,257,0],[65,0,70,0],[71,0,72,0],[0,0,0,1],[1,0,1,2],[5,0,7,0],[2,0,3,0],[9,0,60,0],[48,1,51,1],[52,1,60,1],[100,0,101,0],[102,0,103,0],[104,0,112,0],[73,0,74,0],[77,0,85,0],[211,0,216,0],[217,0,218,0],[219,0,226,0],[245,0,249,0],[250,0,251,0],[227,0,229,0],[230,0,231,0],[232,0,233,0],[234,0,238,0],[240,0,244,0],[192,1,195,1],[205,1,210,1],[196,1,204,1],[140,1,141,1],[142,0,144,0],[145,1,149,1],[150,1,151,1],[153,1,159,1],[160,1,162,1],[163,1,174,1],[175,1,177,1],[178,1,180,1],[182,1,189,1],[145,0,196,0],[205,0,210,0],[140,0,141,0]]}
["Fan Failure Thermal Config Matrix",null,null,null,null,null,null,null,null,null,null,null,null,{"$f":"Summary!D15","v":{"$error":"#DIV/0!"}},"<-- Margin to PS rating"]
["Thermal Config Matrix                                                                                                            Fan fail mode                                                            \"●\"= Full Support without limitation;                                                      \"4,5\"(Cell with number)=Conditional support with limitation;   (See notes below table)\n\" \"(Blank)=Not support; ",null,null,"R1304 HDD WF",null,null,null,"R1208 HDD WF",null,null,null,"R1208 NVME WF"]
["ASHRAE (See note 1)",null,"Classifications","27C","A2","A3","A4","27C","A2","A3","A4","27C","A2","A3","A4"]
[null,null,"Max Ambient","27°C(1)","35°C","40°C","45°C","27°C(1)","35°C","40°C","45°C","27°C(1)","35°C","40°C","45°C"]
[null,null,"Altitude",900,900,900,900,900,900,900,900,900,900,900,900]
["PS (See note 6) ",null,"1300W AC",2,2,2,2,2,2,2,2,2,2,2,2]
[null,null,"1100W AC",2,2,2,2,2,2,2,2,2,2,2,2]
[null,null,"750W DC"," 2, 20, 24","2, 21, 24",2,2,"2, 20, 24","2, 21",2,2]
[null,"173 W","Intel Xeon Platinum 8176F _28C",23,23,null,null,23,null,null,null,23]
["CPU TDP","165 W","Intel® Xeon® Platinum 8276 CPU_28C",23,23,null,null,23,23,null,null,23]
{"$rows_left_out":245}
{"sheet":"Summary","index":4,"n_rows":34,"n_cols":9,"rows_kept":34,"cut":false,"hidden":false,"merged":[[0,1,0,3]]}
["Power Budget",{"$f":"CONCATENATE(INDEX(Chassis!$L$3:$L$14,'Intel Chassis'!$B3),\" / \",INDEX(Serverboard!A$2:A$14,'Serverboard Config'!$B5) )","v":"(Select a Chassis) / (Select Serverboard)"}]
["Chassis/ Power Supply / Cooling:",{"$f":"INDEX(Chassis!A$3:A$14,'Intel Chassis'!$B3)","v":"(Select Chassis)"}]
["Serverboard:",{"$f":"INDEX(Serverboard!A$2:A$14,'Serverboard Config'!$B5)","v":"(Select Serverboard)"}]
["System Totals"," +12V (amps)","12VSB (amps)","Total System Watts "]
[{"$f":"CONCATENATE(\"Processors - Qty \",'Serverboard Config'!C4, \":\")","v":"Processors - Qty 1:"},{"$f":"SUM('Serverboard Config'!F3)","v":0},{"$f":"SUM('Serverboard Config'!G3)","v":0},{"$f":"SUM('Serverboard Config'!H3)","v":0}]
[{"$f":"CONCATENATE(\"Modules + PCI Cards - Qty \",('Serverboard Config'!B10>1) + ('Serverboard Config'!B11>1) + ('Serverboard Config'!B12>1) + ('Serverboard Config'!B13>1) +('Serverboard Config'!B14>1)+('Serverboard Config'!B15>1)+('Serverboard Config'!B16>1)+('Serverboard Config'!B17>1)+('Serverboard Config'!B20>1)+('Serverboard Config'!B21>1),\":\")","v":"Modules + PCI Cards - Qty 0:"},{"$f":"SUM('Serverboard Config'!F10:F21)","v":0},{"$f":"SUM('Serverboard Config'!G10:G21)","v":0},{"$f":"SUM('Serverboard Config'!H10:H21)","v":0}]
[{"$f":"CONCATENATE(\"HDD/SSD - Qty \",'Intel Chassis'!C4+'Intel Chassis'!C5+'Intel Chassis'!C6,\":\")","v":"HDD/SSD - Qty 0:"},{"$f":"SUM('Intel Chassis'!G4:G6)","v":0},0,{"$f":"SUM('Intel Chassis'!I4:I6)","v":0}]
["Serverboard & Memory:",{"$f":"SUM('Serverboard Config'!F5:F8)","v":0},{"$f":"SUM('Serverboard Config'!G5:G6)","v":0},{"$f":"SUM('Serverboard Config'!H5:H8)","v":0}]
["Chassis & Peripherals:",{"$f":"_Sys12 - B7","v":0},{"$f":"'Intel Chassis'!H15","v":0},{"$f":"3.3*Sys3.3+5*_Sys5+ 12*_Sys12-D7","v":0}]
["System Totals:",{"$f":"SUM(B5:B9)","v":0},{"$f":"SUM(C5:C9)","v":0},{"$f":"SUM(D5:D9)","v":0}]
{"$rows_left_out":25}
{"sheet":"Intel Chassis","index":5,"n_rows":22,"n_cols":11,"rows_kept":22,"cut":false,"hidden":false,"merged":[]}
["Power Budget",{"$f":"CONCATENATE(INDEX(Chassis!$L$3:$L$14,B3), \" System Configuration\")","v":"(Select a Chassis) System Configuration"},null,null,null,null,null,null,null,null,"HSBP VRM Efficiency"]
["System Feature","Description","Qty",null,"+3.3V (amps)","+5V (amps)"," +12V (amps)","12V \nstby (amps)","Power\n(watts)",null,{"$f":"INDEX(Chassis!$G$3:$G$14,B3)","v":1}]
["Chassis:",1,null,null,null,null,{"$f":"INDEX(Chassis!$E$3:$E$14,B3)+IF(INDEX(Chassis!$F$3:$F$14,B3)=\"Y\",(INDEX(Processors!C2:C89,'Serverboard Config'!B3)*'Serverboard Config'!C4),0)","v":0},null,{"$f":"G3*12+H3*12","v":0}]
["1st HDD/SSD Type: ",1,0,null,null,{"$f":"INDEX(HardDrive!$C$2:$C$18,B4) *C4 * 1","v":0},{"$f":"(INDEX(HardDrive!$D$2:$D$18,B4)*C4+((F4*5)/12)/$K$2) *1","v":0},null,0,{"$f":"IF($C$4+$C$5+$C$6>(INDEX(HardDrive!$F$21:$F$34*$C$7,'Intel Chassis'!$B$7))+(INDEX(HardDrive!$F$21:$F$34*$C$8, $B$8))+(INDEX(HardDrive!$F21:$F$34*$C$9, $B$9)),\" <-- Max Supported HDD Count Exceeded!\",\" \")","v":" "}]
["2nd HDD/SSD Type: ",1,0,null,null,{"$f":"INDEX(HardDrive!$C$2:$C$18,B5) *C5 *1","v":0},{"$f":"(INDEX(HardDrive!$D$2:$D$18,B5) *C5+((F5*5)/12)/$K$2) *1","v":0},null,0,{"$f":"IF($C$4+$C$5+$C$6>(INDEX(HardDrive!$F$21:$F$34*$C$7,'Intel Chassis'!$B$7))+(INDEX(HardDrive!$F$21:$F$34*$C$8, $B$8))+(INDEX(HardDrive!$F22:$F$34*$C$9, $B$9)),\" <-- Max Supported HDD Count Exceeded!\",\" \")","v":" "}]
["3rd HDD/SSD Type: ",1,0,null,null,{"$f":"INDEX(HardDrive!$C$2:$C$18,B6) *C6 *1","v":0},{"$f":"(INDEX(HardDrive!$D$2:$D$18,B6) *C6+((F6*5)/12)/$K$2) *1","v":0},null,0,{"$f":"IF($C$4+$C$5+$C$6>(INDEX(HardDrive!$F$21:$F$34*$C$7,'Intel Chassis'!$B$7))+(INDEX(HardDrive!$F$21:$F$34*$C$8, $B$8))+(INDEX(HardDrive!$F23:$F$34*$C$9, $B$9)),\" <-- Max Supported HDD Count Exceeded!\",\" \")","v":" "}]
[" 1st Backplane Type: ",1,0,null,null,null,{"$f":"(INDEX(HardDrive!$D$21:$D$34,B7) *C7+((F7*5)/12)/$K$2) *1","v":0},null,0]
["2nd Backplane Type: ",1,0,null,null,null,{"$f":"(INDEX(HardDrive!$D$21:$D$34,B8) *C8+((F8*5)/12)/$K$2) *1","v":0},null,{"$f":"G8*12+H8*12","v":0}]
["Rear  Backplane: ",1,0,null,null,null,{"$f":"(INDEX(HardDrive!$B$37:$B$39,B9) *C9+((F9*5)/12)/$K$2) *1","v":0},null,{"$f":"G9*12+H9*12","v":0}]
["Midplane Expander: ",1,1,null,null,null,{"$f":"(INDEX(Peripherals!$D$17:$D$22,B10) *C10) *1","v":0},null,0]
{"$rows_left_out":13}
{"sheet":"Serverboard Config","index":6,"n_rows":36,"n_cols":24,"rows_kept":36,"cut":false,"hidden":false,"merged":[[0,1,0,7],[6,0,6,1]]}
["Power Budget",{"$f":"CONCATENATE(INDEX(Serverboard!A$2:A$14,$B5),\" Configuration\")","v":"(Select Serverboard) Configuration"},null,null,null,null,null,null,null,"CPU VRM Efficiency","Mem VR Efficiency","3.3v VRM Efficiency","5v VRM Efficiency","3.3 Stby VR Efficiency"]
["Serverboard Feature","Description","Qty","+3.3V (amps)","+5V (amps)"," +12V (amps)","12V \nstby (amps)","Power (watts)",null,{"$f":"INDEX(Serverboard!E$2:E$12,$B5)","v":1},{"$f":"INDEX(Serverboard!F$2:F$12,$B5)","v":1},{"$f":"INDEX(Serverboard!G$2:G$12,$B5)","v":1},{"$f":"INDEX(Serverboard!H$2:H$12,$B5)","v":1},{"$f":"INDEX(Serverboard!I$2:I$12,$B5)","v":1},"<--Hide these columns"]
["Processors:",1,null,null,null,{"$f":"C4*INDEX(Processors!B$2:B$89,$B3)/12/VRMefficiency*0.9","v":0},null,{"$f":"F3*12+E3*5","v":0}]
[null,"Quantity:",1]
["Serverboard:",1,null,null,null,{"$f":"INDEX(Serverboard!B$2:B$14,$B5) *1","v":0},{"$f":"INDEX(Serverboard!C$2:C$14,$B5) *1","v":0},{"$f":"INDEX(Serverboard!D$2:D$14,$B5) *1","v":0},null,null,null,null,null,null,null,null,"DCPMM Linked Cells"]
["Memory:",1,{"$f":"X12+1","v":1},null,null,{"$f":"IFERROR(IF(C6=1,0,(((HLOOKUP(INDEX(Memory!A32:A45,$C6),Memory!B5:N22,B6+2,FALSE))/12/_MemVR*0.9))+(X9/12)),\"0.00\")","v":0},null,{"$f":"D6*3.3+E6*5+F6*12+G6*12","v":0},{"$f":"IFERROR(IF(C6=1,\"\",IF(HLOOKUP(INDEX(Memory!A32:A45,$C6),Memory!B5:N22,B6+2,FALSE)=\"na\",\"<-- unsupported DIMM config\",\"\")),\" \")","v":""},null,null,null,null,null,null,null,"0","<-Dimm QTY"]
["                                                                                           Memory Frequency:                             "]
["Intel® DCPMM:",null,null,null,null,{"$f":"IFERROR((((Q6*Q8)/12)/K2)*0.9,0)","v":0},null,{"$f":"F8*12","v":0},{"$f":"IFERROR(IF(OR((S8<Q9),(S8+Q9>24)),\"<-- Unsupported Memory and DCPMM Configuration\",\" \"),\" \")","v":" "},null,null,null,null,null,null,null,"0","<-Dimm PWR",{"$f":"INDEX(Memory!A32:A45,$C6)","v":0}]
[null,"Selected Power (Watts):",null,null,null,null,null,null,null,null,null,null,null,null,null,null,{"$f":"VALUE(Q6)","v":0},null,null,null,null,null,null,{"$f":"X10*X11","v":0}]
["PCI Card #1:",1,null,{"$f":"INDEX(PCI!B$3:B$21,$B10)","v":0},{"$f":"INDEX(PCI!C$3:C$21,$B10)","v":0},{"$f":"INDEX(PCI!D$3:D$21,$B10)+((D10*3.3)/12)/$L$2+((E10*5)/12)/$M$2","v":0},{"$f":"((INDEX(PCI!$E$3:$E$21,$B10)*3.3)+(INDEX(PCI!$F$3:$F$21,$B10))*5)/12/_stbyVRM","v":0},{"$f":"F10*12+G10*12","v":0},null,null,null,null,null,null,null,null,null,null,null,null,null,null,null,"0"]
{"$rows_left_out":27}
{"sheet":"Serverboard","index":7,"n_rows":12,"n_cols":10,"rows_kept":12,"cut":false,"hidden":true,"merged":[]}
["Serverboard",12,"12VSB","Watts","CPU VR\nEff%","Mem VR Eff%","5v VR\nEff%","3v VR\nEff%","Stby/Aux Eff%"]
["(Select Serverboard)",null,null,null,1,1,1,1,1]
["Intel® Server Board S2600WFT",4.7,0.19,{"$f":"B3*12+C3*12","v":58.680000000000007},0.88,0.88,0.85,0.9,0.87]
["Intel® Server Board S2600WFQ",4.7,0.19,{"$f":"B4*12+C4*12","v":58.680000000000007},0.88,0.88,0.85,0.9,0.87]
["Intel® Server Board S2600WF0",4.7,0.19,{"$f":"B5*12+C5*12","v":58.680000000000007},0.88,0.88,0.85,0.9,0.87]
["Intel® Server Board S2600WFS",4.7,0.19,58.680000000000007,0.88,0.88,0.85,0.9,0.87]
["Intel® Server Board S2600WFTF",4.7,0.19,{"$f":"B7*12+C7*12","v":58.680000000000007},0.88,0.88,0.85,0.9,0.87]
[null,null,null,0,0.8,0.8,0.8,0.8,0.8,"<-- Define Custom Numbers Here"]
[null,null,null,0,0.8,0.8,0.8,0.8,0.8,"<-- Define Custom Numbers Here"]
[null,null,null,0,0.8,0.8,0.8,0.8,0.8,"<-- Define Custom Numbers Here"]
{"$rows_left_out":3}
{"sheet":"Chassis","index":8,"n_rows":19,"n_cols":21,"rows_kept":19,"cut":false,"hidden":false,"merged":[[0,1,0,2],[0,16,0,19],[0,12,0,15],[0,7,0,10]]}
["Chassis",null,null,"Total","Fans","HS Fan","HSBP ","PS Eff%",null,null,null,"Product Name","Total 12 DC Current (Amps)",null,null,null,"Total DC Ouput (Watts)"]
["Selection","12V","12VSB","Watts","12V","(Y/N)","VR Eff%","220VAC","115VAC","-48DCV","-60DCV",null,"220VAC","115VAC","-48DCV","-60DCV","220VAC","115VAC","-48DCV","-60DCV"]
["(Select Chassis)",null,null,null,null,null,1,1,1,1,1,"(Select a Chassis)"]
["R1XXX (1U 750W DC PSU)",{"$f":"INDEX(M4:P4,Summary!$B$19)","v":0},2.1,{"$f":"INDEX(Q4:T4,Summary!$B$19)","v":0},{"$f":"6*2.1","v":12.600000000000001},"N",0.9,null,null,0.9,0.9,"R1XXX",null,null,62,62,null,null,750,750]
["R1XXX (1U 1100W AC PSU)",{"$f":"INDEX(M5:P5,Summary!$B$19)","v":92},2.1,{"$f":"INDEX(Q5:T5,Summary!$B$19)","v":1100},{"$f":"6*2.1","v":12.600000000000001},"N",0.9,0.94,0.92,null,null,"R1XXX",92,75,null,null,1100,900]
["R1XXX (1U 1300W AC PSU)",{"$f":"INDEX(M6:P6,Summary!$B$19)","v":108},2.1,{"$f":"INDEX(Q6:T6,Summary!$B$19)","v":1300},{"$f":"6*2.1","v":12.600000000000001},"N",0.9,0.94,0.92,null,null,"R1XXX",108,62,null,null,1300,750]
["R2XXX (2U 750W DC PSU)",{"$f":"INDEX(M7:P7,Summary!$B$19)","v":0},2.1,{"$f":"INDEX(Q7:T7,Summary!$B$19)","v":0},{"$f":"6*1.6","v":9.6000000000000014},"Y",0.9,null,null,0.9,0.9,"R2XXX",null,null,62,62,null,null,750,750]
["R2XXX (2U 1100W AC PSU)",{"$f":"INDEX(M8:P8,Summary!$B$19)","v":92},2.1,{"$f":"INDEX(Q8:T8,Summary!$B$19)","v":1100},{"$f":"6*1.6","v":9.6000000000000014},"Y",0.9,0.94,0.92,null,null,"R2XXX",92,75,null,null,1100,900]
["R2XXX (2U 1300W AC PSU)",{"$f":"INDEX(M9:P9,Summary!$B$19)","v":108},2.1,{"$f":"INDEX(Q9:T9,Summary!$B$19)","v":1300},9.6000000000000014,"Y",0.9,0.96,0.92,null,null,"R2XXX",108,62,null,null,1300,750]
["User Definable",{"$f":"INDEX(M10:P10,Summary!$B$19)","v":0},null,{"$f":"INDEX(Q10:T10,Summary!$B$19)","v":0},null,"N",0.8,0.8,0.8,0.8,0.8,null,null,null,null,null,null,null,null,null,"<-- Define Custom Numbers Here"]
{"$rows_left_out":10}
{"sheet":"Processors","index":9,"n_rows":99,"n_cols":6,"rows_kept":99,"cut":false,"hidden":false,"merged":[]}
["Processor Types","TDP (W)","HS Fan (A)","Source",null,"VRM#1"]
["(Select Processor)",null,null,null,null,"5V VRM"]
["Intel® Xeon® Platinum 8280 CPU (205W)",205]
["Intel® Xeon® Platinum 8276 CPU (165W)",165]
["Intel® Xeon® Platinum 8270 CPU (205W)",205]
["Intel® Xeon® Platinum 8268 CPU (205W)",205]
["Intel® Xeon® Platinum 8260Y CPU (165W)",165]
["Intel® Xeon® Platinum 8260 CPU (165W)",165]
["Intel® Xeon® Platinum 8256 CPU (105W)",105]
["Intel® Xeon® Platinum 8253 CPU (125W)",125]
{"$rows_left_out":90}
{"sheet":"Memory","index":10,"n_rows":45,"n_cols":29,"rows_kept":45,"cut":false,"hidden":false,"merged":[[3,1,3,13],[0,1,0,13],[4,17,4,19]]}
[null,"Watts of +12V"]
[]
[null,"1DPC","1DPC","1DPC","1DPC","1DPC","1DPC","1DPC","1&2DPC","1&2DPC","1&2DPC","1&2DPC","1&2DPC","2DPC"]
[null,"# of DIMMS",null,null,null,null,null,null,null,null,null,null,null,null,null,null,null,null,null,null,null,null,null,null,null,null,null,null,"Config"]
["Memory",1,2,4,6,8,10,12,14,16,18,20,22,24,null,null,null,"TDP",null,null,null,null,"CPU1","CPU2",null,"TOTAL"]
[]
["(Select Memory)",null,null,null,null,null,null,null,null,null,null,null,null,null,null,null,null,"1DPC","2DPC","3DPC",null,null,1,1,null,{"$f":"+W7+X7","v":2},null,null,"1DPC"]
["8GB DDR4 RDIMM (4Gb, SRx4)",{"$f":"$R8*B$5","v":5.67},{"$f":"$R8*C$5","v":11.34},22.68,34.019999999999996,45.36,56.7,68.039999999999992,{"$f":"($R8*($H$5-(I$5-$H$5)))+($S8*((I$5-$H$5)*2))","v":73.7},{"$f":"($R8*($H$5-(J$5-$H$5)))+($S8*((J$5-$H$5)*2))","v":79.36},85.02,90.68,96.34,102,null,null,null,5.67,4.25,null,null,null,2,2,null,4,null,null,"1DPC"]
["8GB DDR4 RDIMM (8Gb, SRx8)",3.66,7.32,14.64,21.96,29.28,36.6,43.92,47.56,51.2,54.84,58.480000000000004,62.120000000000005,65.760000000000005,null,null,null,3.66,2.74,null,null,null,3,3,null,6,null,null,"1DPC"]
["16GB DDR4 RDIMM (8Gb, SRx4)",5.35,10.7,21.4,32.099999999999994,42.8,53.5,64.199999999999989,67.739999999999995,71.28,74.819999999999993,78.36,81.900000000000006,85.44,null,null,null,5.35,3.56,null,null,null,4,4,null,8,null,null,"1DPC"]
{"$rows_left_out":36}
{"sheet":"DCPMM","index":11,"n_rows":45,"n_cols":31,"rows_kept":45,"cut":false,"hidden":false,"merged":[[0,1,0,13],[3,1,3,13],[4,17,4,19]]}
[null,"Watts of +12V"]
[]
[null,"1DPC","1DPC","1DPC","1DPC","1DPC","1DPC","1DPC","1&2DPC","1&2DPC","1&2DPC","1&2DPC","1&2DPC","2DPC"]
[null,"# of DIMMS",null,null,null,null,null,null,null,null,null,null,null,null,null,null,null,null,null,null,null,null,null,null,null,null,null,null,"Config"]
["Memory",1,2,4,6,8,10,12,14,16,18,20,22,24,null,null,null,"TDP",null,null,null,null,"CPU1","CPU2",null,"TOTAL",null,null,null,null," "]
[]
["(Select DCPMM)",null,null,null,null,null,null,null,null,null,null,null,null,null,null,null,null,"1DPC","2DPC","3DPC",null,null,1,1,null,{"$f":"+W7+X7","v":2},null,null,"1DPC"]
["Intel® Optane™ DC Persistent Memory  (128 GB)",null,null,null,null,null,null,null,null,null,null,null,null,null,null,null,null,5.67,4.25,null,null,null,2,2,null,4,null,null,"1DPC"]
["Intel® Optane™ DC Persistent Memory  (256 GB)",null,null,null,null,null,null,null,null,null,null,null,null,null,null,null,null,3.66,2.74,null,null,null,3,3,null,6,null,null,"1DPC"]
["Intel® Optane™ DC Persistent Memory  (512 GB)",null,null,null,null,null,null,null,null,null,null,null,null,null,null,null,null,5.35,3.56,null,null,null,4,4,null,8,null,null,"1DPC"]
{"$rows_left_out":36}
{"sheet":"PCI","index":12,"n_rows":59,"n_cols":8,"rows_kept":59,"cut":false,"hidden":false,"merged":[]}
[null,"Amps of +3.3V","Amps of +5V","Amps of +12V","Amps of    3.3V Stby","Amps of    5V Stby","Watts"]
["PCI Add in Cards"]
["Slot Empty",null,null,null,null,null," "]
["PCIe (3V) Typical",3,null,null,null,null,{"$f":"B4*3.3+C4*5+D4*12+E4*3.3+F4*5","v":9.8999999999999986}]
["PCIe (3.3V / 12V) Typical",2,null,0.25,null,null,9.6]
["PCIe (3.3V / 12V) High",2,null,0.7,null,null,14.999999999999998]
["RS3DC080",0.79300000000000004,null,1.0900000000000001,1E-3,null,15.700200000000001]
["RES3FV288",null,null,1.04,null,null,12.48]
["AXXP3RTX16040",null,null,null,null,null,12.2]
["AXXP3SWX08040",null,null,1.542,null,null,18.5]
{"$rows_left_out":50}
{"sheet":"HardDrive","index":13,"n_rows":39,"n_cols":7,"rows_kept":39,"cut":false,"hidden":false,"merged":[]}
["Hard Drives","Amps of +3.3V","Amps of +5V","Amps of +12V","Watts"]
["Empty"]
["3.5\" SATA Typical Power (12W)",null,0.44,0.78,{"$f":"B3*3.3+C3*5+D3*12","v":11.559999999999999}]
["3.5\" SAS Typical Power (12W)",null,0.6,0.76,{"$f":"B4*3.3+C4*5+D4*12","v":12.120000000000001}]
["2.5\" SATA Typical Power (5W)",null,1,0,5]
["2.5\" SAS Typical Power (9W)",null,0.81,0.41,8.9700000000000006]
["Intel® SSD DC Typical Power (3.5W)",null,0.22,0.2,{"$f":"B7*3.3+C7*5+D7*12","v":3.5000000000000004}]
["Intel® SSD DC Typical Power (7W)",null,0.9,0.2,6.9]
["3.5\" SAS Power (9.5W)",null,0.44,0.61,{"$f":"B9*3.3+C9*5+D9*12","v":9.52}]
["3.5\" SATA Power (10.7W)",null,0.32,0.76,10.72]
{"$rows_left_out":30}
{"sheet":"Peripherals","index":14,"n_rows":22,"n_cols":7,"rows_kept":22,"cut":false,"hidden":false,"merged":[]}
["Misc Peripherals","Amps of +3.3V","Amps of +5V","Amps of +12V","Amps of 3VSB","Watts"]
["Slim-Line Devices"]
["Empty"]
["User Definable",null,null,null,null,{"$f":"B4*3.3+C4*5+D4*12++E4*3.3","v":0},"<-- Define Custom Peripherals Here"]
["User Definable",null,null,null,null,0,"<-- Define Custom Peripherals Here"]
["User Definable",null,null,null,null,0,"<-- Define Custom Peripherals Here"]
["User Definable",null,null,null,null,0,"<-- Define Custom Peripherals Here"]
[]
["SSD Drives"]
["Empty"]
{"$rows_left_out":13}
{"sheet":"Revision","index":15,"n_rows":12,"n_cols":4,"rows_kept":12,"cut":false,"hidden":false,"merged":[]}
[{"$f":"LARGE(A4:A27,1)","v":"2018-09-12"},{"$f":"MAX(B4:B27)","v":2},null,"<=== Linked to Summary Tab."]
[]
["Date","Rev","Notes","Init"]
["2016-04-16",0.1,"Initial Draft - working copy","JZ"]
["2016-11-15",0.5,"Beta release for review","JZ"]
["2017-04-27",0.52,"Configuration matrix updated","ODR"]
["2017-06-08",0.55000000000000004,"System tabs updated","HS"]
["2017-06-12",0.7,"Thermal tabs \"Normal Config\" and \"Fan Fail Config\" updated","HS"]
["2017-06-15","0.71","Fixed input voltaje scroll down menu","HS"]
["2017-07-14",1,"Fixed format in Thermal tabs - Added new CPU's","HS"]
{"$rows_left_out":2}